[gst-devel] build error

Manuel ngroeneweg at chello.nl
Mon Apr 16 11:01:43 CEST 2001


I'm trying to build Gstreamer on a Mandrake 8.0 beta machine, but it fails
on this:


make[3]: Entering directory `/root/gstreamer-0.1.1/test'
/bin/sh ../libtool --mode=link
gcc  -I/usr/include/glib-1.2 -I/usr/lib/glib/include -D_REENTRANT -I/usr/inc
lude/gtk-1.2 -I/usr/include/glib-1.2 -I/usr/lib/glib/include -I/usr/X11R6/in
clude -I/usr/include/gnome-xml  -O6 -Wall -I.. -I../include -I/usr/include -
DNEED_GNOMESUPPORT_H -I/usr/lib/gnome-libs/include -I/usr/include/gtk-1.2 -I
/usr/include/glib-1.2 -I/usr/lib/glib/include -I/usr/X11R6/include -I.. -I..
/include  -o qtest  qtest.o
../plugins/videosink/gdkxvimage.lo -lXv -lXxf86vm -L/usr/lib -rdynamic -lgmo
dule -lgthread -lglib -lpthread -ldl -L/usr/lib -L/usr/X11R6/lib -lgtk -lgdk
 -rdynamic -lgmodule -lglib -ldl -lXi -lXext -lX11 -lm -L/usr/lib -lxml -lz 
 -rdynamic -L/usr/lib -L/usr/X11R6/lib -lgnomeui -lart_lgpl -lgdk_imlib -lSM
 -lICE -lgtk -lgdk -lgmodule -lXi -lXext -lX11 -lgnome -lgnomesupport -lesd 
-laudiofile -lm -ldb1 -lglib -ldl ../gst/libgst.la
gcc -I/usr/include/glib-1.2 -I/usr/lib/glib/include -D_REENTRANT -I/usr/incl
ude/gtk-1.2 -I/usr/include/glib-1.2 -I/usr/lib/glib/include -I/usr/X11R6/inc
lude -I/usr/include/gnome-xml -O6 -Wall -I.. -I../include -I/usr/include -DN
EED_GNOMESUPPORT_H -I/usr/lib/gnome-libs/include -I/usr/include/gtk-1.2 -I/u
sr/include/glib-1.2 -I/usr/lib/glib/include -I/usr/X11R6/include -I.. -I../i
nclude -o .libs/qtest qtest.o
../plugins/videosink/gdkxvimage.o -lXv -lXxf86vm -L/usr/lib -rdynamic -lgmod
ule -lgthread -lglib -lpthread -ldl -L/usr/lib -L/usr/X11R6/lib -lgtk -lgdk 
-rdynamic -lgmodule -lglib -ldl -lXi -lXext -lX11 -lm -L/usr/lib -lxml -lz -
rdynamic -L/usr/lib -L/usr/X11R6/lib -lgnomeui -lart_lgpl -lgdk_imlib -lSM -
lICE -lgtk -lgdk -lgmodule -lXi -lXext -lX11 -lgnome -lgnomesupport -lesd -l
audiofile -lm -ldb1 -lglib -ldl
../gst/.libs/libgst.so -lgmodule -lgthread -lglib -lpthread -ldl -lgtk -lgdk
 -lgmodule -lglib -ldl -lXi -lXext -lX11 -lm -lxml -lz  -Wl,--rpath -Wl,/usr
/usr/bin/ld: cannot find -ldb1
collect2: ld returned 1 exit status
make[3]: *** [qtest] Error 1
make[3]: Leaving directory `/root/gstreamer-0.1.1/test'
make[2]: *** [all-recursive] Error 1
make[2]: Leaving directory `/root/gstreamer-0.1.1/test'
make[1]: *** [all-recursive] Error 1
make[1]: Leaving directory `/root/gstreamer-0.1.1'
make: *** [all-recursive-am] Error 2


I have no real Linux programming experience, help is very appreciated..
The machine is running on an Athlon 650Mhz if that's of any help.


More information about the gstreamer-devel mailing list