[packagekit] PackageKit-Qt build failure

Richard Hughes hughsient at gmail.com
Tue May 5 04:11:33 PDT 2009

I'm planning to do a release today, but get a build failure in

daemontest.cpp: In member function ‘void DaemonTest::getActions()’:
daemontest.cpp:14: error: ‘class QFlags<PackageKit::Client::Action>’ has no member named ‘contains’
daemontest.cpp: In member function ‘void DaemonTest::getFilters()’:
daemontest.cpp:26: error: ‘class QFlags<PackageKit::Client::Filter>’ has no member named ‘contains’
make[4]: *** [daemontest.o] Error 1
make[4]: Leaving directory `/home/hughsie/Code/PackageKit/lib/packagekit-qt/test'
make[3]: *** [check-am] Error 2
make[3]: Leaving directory `/home/hughsie/Code/PackageKit/lib/packagekit-qt/test'
make[2]: *** [check-recursive] Error 1
make[2]: Leaving directory `/home/hughsie/Code/PackageKit/lib/packagekit-qt'
make[1]: *** [check-recursive] Error 1
make[1]: Leaving directory `/home/hughsie/Code/PackageKit/lib'

Any ideas?


More information about the PackageKit mailing list