[gst-devel] Hi all..........

Vaisakh N. vaisakh.n at nestgroup.net
Mon Dec 22 11:37:53 CET 2008

Now am looking to install gst-plugins-base 0.10.21
after ./configure
in the make && make install ...
it gives error like this
Making all in icles
make[3]: Entering directory `/home/gst-plugins-base-0.10.21/tests/icles'
/bin/sh ../../libtool --tag=CC   --mode=link gcc  -g -O2   -o test-colorkey
gcc -g -O2 -o test-colorkey
gcc: no input files
make[3]: *** [test-colorkey] Error 1
make[3]: Leaving directory `/home/gst-plugins-base-0.10.21/tests/icles'
make[2]: *** [all-recursive] Error 1
make[2]: Leaving directory `/home/gst-plugins-base-0.10.21/tests'
make[1]: *** [all-recursive] Error 1
make[1]: Leaving directory `/home/gst-plugins-base-0.10.21'
make: *** [all] Error 2
i found that its due to version problem of gtk+ devel ...
is it correct??
is there any way other than installing gtk+...?

thanks to all for u r last support..........

-------------- next part --------------
A non-text attachment was scrubbed...
Name: not available
Type: application/ms-tnef
Size: 2797 bytes
Desc: not available
URL: <http://lists.freedesktop.org/archives/gstreamer-devel/attachments/20081222/f1dfd714/attachment.bin>

More information about the gstreamer-devel mailing list