✗ Fi.CI.BAT: failure for series starting with [1/2] HAX enable guc submission for CI

Patchwork patchwork at emeril.freedesktop.org
Tue Feb 28 21:32:17 UTC 2017


== Series Details ==

Series: series starting with [1/2] HAX enable guc submission for CI
URL   : https://patchwork.freedesktop.org/series/20359/
State : failure

== Summary ==

  CC [M]  drivers/gpu/drm/i915/gvt/cmd_parser.o
  CC [M]  drivers/gpu/drm/i915/intel_lpe_audio.o
  LD      drivers/acpi/acpica/acpi.o
  LD      kernel/built-in.o
  LD      drivers/spi/built-in.o
  LD      drivers/tty/serial/8250/8250.o
  LD      drivers/acpi/acpica/built-in.o
  LD      drivers/usb/storage/usb-storage.o
  LD      drivers/usb/storage/built-in.o
  LD      drivers/acpi/built-in.o
  LD      net/xfrm/built-in.o
  LD      drivers/usb/gadget/libcomposite.o
  LD      net/packet/built-in.o
  LD [M]  drivers/net/ethernet/intel/igbvf/igbvf.o
  LD      drivers/scsi/sd_mod.o
  LD      drivers/video/console/built-in.o
  LD      drivers/scsi/built-in.o
  LD      drivers/video/built-in.o
  LD      lib/raid6/raid6_pq.o
  LD [M]  sound/pci/hda/snd-hda-codec-generic.o
  LD      sound/pci/built-in.o
  LD      lib/raid6/built-in.o
drivers/gpu/drm/i915/i915_guc_submission.c: In function ‘i915_guc_wq_unreserve’:
drivers/gpu/drm/i915/i915_guc_submission.c:382:1: error: expected expression before ‘<<’ token
 <<<<<<< c0d4508e27e4e9ffc05dab0d0e590a6e0ddbc106
 ^
drivers/gpu/drm/i915/i915_guc_submission.c:384:1: error: expected expression before ‘==’ token
 =======
 ^
drivers/gpu/drm/i915/i915_guc_submission.c:389:1: error: expected expression before ‘>>’ token
 >>>>>>> drm/i915/guc: Make wq_lock irq-safe
 ^
drivers/gpu/drm/i915/i915_guc_submission.c: In function ‘i915_guc_submission_enable’:
drivers/gpu/drm/i915/i915_guc_submission.c:975:1: error: expected expression before ‘<<’ token
 <<<<<<< c0d4508e27e4e9ffc05dab0d0e590a6e0ddbc106
 ^
drivers/gpu/drm/i915/i915_guc_submission.c:977:1: error: expected expression before ‘==’ token
 =======
 ^
drivers/gpu/drm/i915/i915_guc_submission.c:982:1: error: expected expression before ‘>>’ token
 >>>>>>> drm/i915/guc: Make wq_lock irq-safe
 ^
drivers/gpu/drm/i915/i915_guc_submission.c:966:13: error: unused variable ‘wqi_size’ [-Werror=unused-variable]
   const int wqi_size = sizeof(struct guc_wq_item);
             ^
drivers/gpu/drm/i915/i915_guc_submission.c: At top level:
drivers/gpu/drm/i915/i915_guc_submission.c:366:13: error: ‘guc_client_update_wq_rsvd’ defined but not used [-Werror=unused-function]
 static void guc_client_update_wq_rsvd(struct i915_guc_client *client, int size)
             ^
cc1: all warnings being treated as errors
  LD      sound/built-in.o
scripts/Makefile.build:294: recipe for target 'drivers/gpu/drm/i915/i915_guc_submission.o' failed
make[4]: *** [drivers/gpu/drm/i915/i915_guc_submission.o] Error 1
make[4]: *** Waiting for unfinished jobs....
  LD      drivers/usb/gadget/udc/udc-core.o
  LD      drivers/usb/gadget/udc/built-in.o
  LD      drivers/usb/gadget/built-in.o
  LD      lib/lz4/built-in.o
  LD      drivers/md/md-mod.o
  LD      drivers/md/built-in.o
  LD [M]  drivers/net/ethernet/intel/e1000/e1000.o
  LD      net/ipv6/ipv6.o
  LD      drivers/tty/serial/8250/8250_base.o
  LD      net/ipv6/built-in.o
  LD      drivers/tty/serial/8250/built-in.o
  LD      drivers/tty/serial/built-in.o
  AR      lib/lib.a
  EXPORTS lib/lib-ksyms.o
  LD      lib/built-in.o
  LD      drivers/usb/core/usbcore.o
  LD      drivers/usb/core/built-in.o
  LD      fs/btrfs/btrfs.o
  CC      arch/x86/kernel/cpu/capflags.o
  LD      arch/x86/kernel/cpu/built-in.o
  LD      drivers/tty/vt/built-in.o
  LD      fs/btrfs/built-in.o
  LD      arch/x86/kernel/built-in.o
  LD [M]  drivers/net/ethernet/intel/igb/igb.o
  LD      drivers/tty/built-in.o
  LD      arch/x86/built-in.o
  LD [M]  drivers/net/ethernet/intel/e1000e/e1000e.o
  LD      drivers/usb/host/xhci-hcd.o
  LD      drivers/usb/host/built-in.o
  LD      drivers/usb/built-in.o
  LD      net/core/built-in.o
  LD      fs/ext4/ext4.o
  LD      net/ipv4/built-in.o
  LD      fs/ext4/built-in.o
  LD      fs/built-in.o
  LD      net/built-in.o
  LD      drivers/net/ethernet/built-in.o
  LD      drivers/net/built-in.o
scripts/Makefile.build:553: recipe for target 'drivers/gpu/drm/i915' failed
make[3]: *** [drivers/gpu/drm/i915] Error 2
scripts/Makefile.build:553: recipe for target 'drivers/gpu/drm' failed
make[2]: *** [drivers/gpu/drm] Error 2
scripts/Makefile.build:553: recipe for target 'drivers/gpu' failed
make[1]: *** [drivers/gpu] Error 2
Makefile:990: recipe for target 'drivers' failed
make: *** [drivers] Error 2



More information about the Intel-gfx-trybot mailing list