✗ Fi.CI.BAT: failure for series starting with [1/4] drm/i915: Introduce intel_runtime_pm_disable to pair intel_runtime_pm_enable

Patchwork patchwork at emeril.freedesktop.org
Thu Aug 9 20:39:15 UTC 2018


== Series Details ==

Series: series starting with [1/4] drm/i915: Introduce intel_runtime_pm_disable to pair intel_runtime_pm_enable
URL   : https://patchwork.freedesktop.org/series/47965/
State : failure

== Summary ==

CALL    scripts/checksyscalls.sh
  DESCEND  objtool
  CHK     include/generated/compile.h
  CC [M]  drivers/gpu/drm/i915/i915_pmu.o
drivers/gpu/drm/i915/i915_pmu.c: In function ‘get_rc6’:
drivers/gpu/drm/i915/i915_pmu.c:455:2: error: ‘wakref’ undeclared (first use in this function); did you mean ‘wakeref’?
  wakref = intel_runtime_pm_get_if_in_use(i915)
  ^~~~~~
  wakeref
drivers/gpu/drm/i915/i915_pmu.c:455:2: note: each undeclared identifier is reported only once for each function it appears in
drivers/gpu/drm/i915/i915_pmu.c:456:2: error: expected ‘;’ before ‘if’
  if (wakeref) {
  ^~
drivers/gpu/drm/i915/i915_pmu.c:453:6: error: unused variable ‘val’ [-Werror=unused-variable]
  u64 val;
      ^~~
drivers/gpu/drm/i915/i915_pmu.c:452:16: error: unused variable ‘flags’ [-Werror=unused-variable]
  unsigned long flags;
                ^~~~~
drivers/gpu/drm/i915/i915_pmu.c:451:18: error: unused variable ‘wakeref’ [-Werror=unused-variable]
  intel_wakeref_t wakeref;
                  ^~~~~~~
drivers/gpu/drm/i915/i915_pmu.c:528:1: error: no return statement in function returning non-void [-Werror=return-type]
 }
 ^
At top level:
drivers/gpu/drm/i915/i915_pmu.c:430:12: error: ‘__get_rc6’ defined but not used [-Werror=unused-function]
 static u64 __get_rc6(struct drm_i915_private *i915)
            ^~~~~~~~~
cc1: all warnings being treated as errors
scripts/Makefile.build:317: recipe for target 'drivers/gpu/drm/i915/i915_pmu.o' failed
make[4]: *** [drivers/gpu/drm/i915/i915_pmu.o] Error 1
scripts/Makefile.build:558: recipe for target 'drivers/gpu/drm/i915' failed
make[3]: *** [drivers/gpu/drm/i915] Error 2
scripts/Makefile.build:558: recipe for target 'drivers/gpu/drm' failed
make[2]: *** [drivers/gpu/drm] Error 2
scripts/Makefile.build:558: recipe for target 'drivers/gpu' failed
make[1]: *** [drivers/gpu] Error 2
Makefile:1029: recipe for target 'drivers' failed
make: *** [drivers] Error 2



More information about the Intel-gfx-trybot mailing list