Build Error

Joel Madero at
Thu Oct 18 17:18:03 PDT 2012

Hi All,

I hadn't pulled in awhile (>4 weeks), decided to yesterday, it failed, 
decided to start from scratch -- for a few reasons. Still getting the error:

Oh dear - something failed during the build - sorry !

For more help with debugging build errors, please see the section in:

internal build errors:

ERROR: error 512 occurred while making /data/git/libo/sal/prj

it seems that the error is inside 'sal', please re-run build

inside this module to isolate the error and/or test your fix:

build_error.log should contain the captured output of the failed module(s)


To rebuild a specific module:

make sal.clean # optional

make sal

when the problem is isolated and fixed, re-run 'make'

make[1]: *** [build-packimages] Error 1

make[1]: Leaving directory `/data/git/libo'

make: *** [all] Error 2


-------------- next part --------------
An HTML attachment was scrubbed...
URL: <>

More information about the LibreOffice mailing list