master : build fails

Jean-Baptiste Faure jbf.faure at
Wed Oct 24 00:04:14 PDT 2012


when building the master, I get the following error message:

[build XCU]
touch: impossible de faire un touch
Aucun fichier ou dossier de ce type
make[2]: ***
Erreur 1

followed by the classical:
        Oh dear - something failed during the build - sorry !
  For more help with debugging build errors, please see the section in:

  internal build errors:

ERROR: error 512 occurred while making /home/jbf/LibO/master/tail_build/prj

 it seems that the error is inside 'tail_build', please re-run build
 inside this module to isolate the error and/or test your fix:

build_error.log should contain the captured output of the failed module(s)

To rebuild a specific module:

make tail_build.clean # not recommended, this will re-build almost
make tail_build

when the problem is isolated and fixed, re-run 'make'
make[1]: *** [build-packimages] Erreur 1
make[1]: quittant le répertoire « /home/jbf/LibO/master »
make: *** [dev-install] Erreur 2

The file build_error.log ends with the error message about dictionaries and
the impossibility to do a touch.

I did a ccache -C then make clean then git reset --hard origin/master then
make dev-install and got the same error

Is there something I did wrong ?

Best regards

View this message in context:
Sent from the Dev mailing list archive at

More information about the LibreOffice mailing list