build fails for 4.3 with the last commit on htmlexport

Jean-Baptiste Faure jbfaure at
Mon Oct 20 06:47:59 PDT 2014


the last commit on branch 4.3 (html export: Fix export of checked
checkbox and radiobutton.) seems to break the build :

> .../LibO/lo43/sw/qa/extras/htmlexport/htmlexport.cxx: In member function ‘virtual void testExportCheckboxRadioButtonState::verify()’:
> .../LibO/lo43/sw/qa/extras/htmlexport/htmlexport.cxx:176:68: error: ‘assertXPathNoAttribute’ was not declared in this scope
>      assertXPathNoAttribute(pDoc, "/html/body/p[2]/input", "checked");
>                                                                     ^
> make[1]: *** [.../LibO/lo43/workdir/CxxObject/sw/qa/extras/htmlexport/htmlexport.o] Erreur 1
> make[1]: *** Attente des tâches non terminées....
> make: *** [build] Erreur 2

I did only an incremental build, perhaps I must do a complete rebuild ?

Best regards.
Seuls des formats ouverts peuvent assurer la pérennité de vos documents.

More information about the LibreOffice mailing list