Windows Debug builds failure: 'DbgGUIInitSolarMutexCheck': identifier not found

Luke Benes lukebenes at
Tue Jul 31 03:54:05 UTC 2018

Ever since:
make DBG_TESTSOLARMUTEX available in assert builds

Windows builds with "--enable-debug" are failing with the following error:

D:/core/vcl/source/app/svmain.cxx(371): error C3861: 'DbgGUIInitSolarMutexCheck': identifier not found
make[1]: *** [D:/core/solenv/gbuild/ D:/core/workdir/CxxObject/vcl/source/app/svmain.o] Error 2
make[1]: *** Waiting for unfinished jobs....
make: *** [Makefile:286: build] Error 2

Should your change be limited to Linux or something else going on here?


More information about the LibreOffice mailing list