[Mesa-dev] Current tinderbox regression (mesa dri/i965)

Chris Ball cjb at laptop.org
Wed Sep 22 06:47:26 PDT 2010


brw_context.c:45: error: array type has incomplete element type
brw_context.c:46: error: 'GL_VERSION_2_1_functions' undeclared here
brw_context.c: In function 'brwCreateContext':
brw_context.c:163: warning: implicit declaration of function 'driInitExtensions'
gmake[6]: *** [brw_context.o] Error 1

Chris Ball   <cjb at laptop.org>
One Laptop Per Child

More information about the mesa-dev mailing list