[Mesa-dev] [Bug 61992] New: LLVM Build fail

bugzilla-daemon at freedesktop.org bugzilla-daemon at freedesktop.org
Thu Mar 7 15:35:21 PST 2013


          Priority: medium
            Bug ID: 61992
          Assignee: mesa-dev at lists.freedesktop.org
           Summary: LLVM Build fail
          Severity: normal
    Classification: Unclassified
                OS: Linux (All)
          Reporter: lists at andyfurniss.entadsl.com
          Hardware: x86-64 (AMD64)
            Status: NEW
           Version: git
         Component: Other
           Product: Mesa

./autogen.sh --prefix=/usr --disable-egl --enable-texture-float
--enable-gallium-g3dvl --enable-r600-llvm-compiler
--with-gallium-drivers=r600,swrast --with-dri-drivers=

up to data tstellar/llvm.

make[4]: Entering directory
  CXX      radeon_llvm_emit.lo
radeon_llvm_emit.cpp: In function 'void radeon_llvm_shader_type(LLVMValueRef,
unsigned int)':
radeon_llvm_emit.cpp:82:13: error: 'AttributeSet' has not been declared
radeon_llvm_emit.cpp:87:35: error: no matching function for call to
'llvm::AttrBuilder::addAttribute(const char [11], char [2])'
radeon_llvm_emit.cpp:87:35: note: candidate is:
/usr/include/llvm/Attributes.h:207:16: note: llvm::AttrBuilder&
/usr/include/llvm/Attributes.h:207:16: note:   candidate expects 1 argument, 2
radeon_llvm_emit.cpp:89:3: error: 'AttributeSet' was not declared in this scope
radeon_llvm_emit.cpp:89:16: error: expected ';' before 'Set'
radeon_llvm_emit.cpp:90:9: error: 'class llvm::Function' has no member named
radeon_llvm_emit.cpp:90:28: error: 'Set' was not declared in this scope
make[4]: *** [radeon_llvm_emit.lo] Error 1

You are receiving this mail because:
You are the assignee for the bug.
-------------- next part --------------
An HTML attachment was scrubbed...
URL: <http://lists.freedesktop.org/archives/mesa-dev/attachments/20130307/35147375/attachment.html>

More information about the mesa-dev mailing list