[Pixman] Can't compile 0.25.2

Germán Arias german at xelalug.org
Sat Mar 24 11:15:57 PDT 2012

Hi. I'm trying to build pixman 0.25.2 (since I can't compile 0.24.4, 
there is a problem with getisax
and I can't found where is defined this function). Now with 0.25.2 I 
don't have that error. However
I get the error:

/home/german/Instalados/pixman-0.25.2/demos/clip-test.c:74: undefined 
to `pixman_image_set_clip_region32'
collect2: ld returned 1 exit status
make[2]: *** [clip-test] Error 1
make[2]: Leaving directory 
make[1]: *** [all-recursive] Error 1
make[1]: Leaving directory `/home/german/Instalados/pixman-0.25.2'
make: *** [all] Error 2

Any advice? Thanks.

More information about the Pixman mailing list