[Pixman] As per : Please report to pixman at lists.freedesktop.org

David Lisle david at lisle.ca
Mon Apr 8 11:13:26 PDT 2013

make[2]: *** [check-TESTS] Error 1
make[2]: Leaving directory `/usr/src/pixman-0.28.2/test'
make[1]: *** [check-am] Error 2
make[1]: Leaving directory `/usr/src/pixman-0.28.2/test'
make: *** [check-recursive] Error 1

The test failed.

I am using Slackware
KDE SC Version 4.5.5(KDE 4.5.5)

Compiles as root, added other programs that were dependencies i.e. wv-1.2.4 prior to configuration and make. Make gave no error 
messages or warnings.

This program did not correctly pass the tests, therefore installation is held in abeyance until it does.

There is insufficient information for me to solve this problem.


More information about the Pixman mailing list