[pulseaudio-discuss] Error compiling sconv_sse.c on Mac OS X

Daniel Mack daniel at caiaq.de
Mon Sep 14 01:39:47 PDT 2009


I'm trying to build the current PA git and get the following error
message. Any ideas?


  CC     libpulsecore_0.9.17_la-sconv_sse.lo
pulsecore/sconv_sse.c: In function 'pa_sconv_s16le_from_f32ne_sse':
pulsecore/sconv_sse.c:47: error: can't find a register in class 'GENERAL_REGS' while reloading 'asm'
pulsecore/sconv_sse.c:47: error: 'asm' operand has impossible constraints
make[3]: *** [libpulsecore_0.9.17_la-sconv_sse.lo] Error 1
make[2]: *** [all] Error 2
make[1]: *** [all-recursive] Error 1
make: *** [all] Error 2

More information about the pulseaudio-discuss mailing list