[Spice-devel] compiling virt-viewer 1.0 error

PaulCheung eq2008 at msn.com
Thu Sep 18 22:28:46 PDT 2014

Dear all,
I am compiling virt-viewer 1.0  on debian(arm).   I got the flowing problem!
First I compiled & installed   spice-gtk-0.24.tar.gz
then I install this,     1. ./configure      no error      2. make    and then show the error below:

make[2]: Entering directory `/root/virt-viewer-1.0/src'make  all-ammake[3]: Entering directory `/root/virt-viewer-1.0/src'  CC       remote_viewer-virt-viewer-session-spice.ovirt-viewer-session-spice.c: In function 'virt_viewer_session_spice_main_channel_event':virt-viewer-session-spice.c:528:38: error: missing expression between '(' and ')'make[3]: *** [remote_viewer-virt-viewer-session-spice.o] Error 1make[3]: Leaving directory `/root/virt-viewer-1.0/src'make[2]: *** [all] Error 2make[2]: Leaving directory `/root/virt-viewer-1.0/src'make[1]: *** [all-recursive] Error 1make[1]: Leaving directory `/root/virt-viewer-1.0'make: *** [all] Error 2

Sincerely yours,

 tel: 180-8882-7173
-------------- next part --------------
An HTML attachment was scrubbed...
URL: <http://lists.freedesktop.org/archives/spice-devel/attachments/20140919/ad29a0aa/attachment-0001.html>
-------------- next part --------------
A non-text attachment was scrubbed...
Name: virt-viewer make error.png
Type: image/png
Size: 86750 bytes
Desc: not available
URL: <http://lists.freedesktop.org/archives/spice-devel/attachments/20140919/ad29a0aa/attachment-0001.png>

More information about the Spice-devel mailing list