[Bug 64212] New: account-storage/default-keyring-storage.py test failed

bugzilla-daemon at freedesktop.org bugzilla-daemon at freedesktop.org
Sat May 4 13:38:03 CEST 2013


https://bugs.freedesktop.org/show_bug.cgi?id=64212

          Priority: medium
            Bug ID: 64212
          Assignee: telepathy-bugs at lists.freedesktop.org
           Summary: account-storage/default-keyring-storage.py test failed
        QA Contact: telepathy-bugs at lists.freedesktop.org
          Severity: normal
    Classification: Unclassified
                OS: All
          Reporter: pacho at condmat1.ciencias.uniovi.es
          Hardware: Other
            Status: NEW
           Version: git master
         Component: mission-control
           Product: Telepathy

Created attachment 78837
  --> https://bugs.freedesktop.org/attachment.cgi?id=78837&action=edit
build.log

We get:
make[7]: Entering directory
`/var/tmp/portage/net-im/telepathy-mission-control-5.14.1/work/telepathy-mission-control-5.14.1/tests/twisted'
Adding to env:
GNOME_KEYRING_CONTROL=/var/tmp/portage/net-im/telepathy-mission-control-5.14.1/temp/run/keyring-1aExD8
Adding to env:
SSH_AUTH_SOCK=/var/tmp/portage/net-im/telepathy-mission-control-5.14.1/temp/run/keyring-1aExD8/ssh
Adding to env:
GPG_AGENT_INFO=/var/tmp/portage/net-im/telepathy-mission-control-5.14.1/temp/run/keyring-1aExD8/gpg:0:1
Adding to env: GNOME_KEYRING_PID=22584
Gkr-Message: secret service operation failed: Couldn't create new collection

** (process:22590): WARNING **: Failed to create keyring mc-test-3022435581:
Error communicating with gnome-keyring-daemon
Traceback (most recent call last):
  File "./account-storage/default-keyring-storage.py", line 315, in <module>
    start_gnome_keyring_daemon(ctl_dir)
  File "./account-storage/default-keyring-storage.py", line 104, in
start_gnome_keyring_daemon
    assert keyring_name
AssertionError
FAIL: account-storage/default-keyring-storage.py
==================
1 of 1 test failed
==================
make[7]: *** [check-TESTS] Error 1
make[7]: Leaving directory
`/var/tmp/portage/net-im/telepathy-mission-control-5.14.1/work/telepathy-mission-control-5.14.1/tests/twisted'
make[6]: *** [check-separate] Error 2
make[6]: Leaving directory
`/var/tmp/portage/net-im/telepathy-mission-control-5.14.1/work/telepathy-mission-control-5.14.1/tests/twisted'
make[5]: *** [check-twisted] Error 2
make[5]: Leaving directory
`/var/tmp/portage/net-im/telepathy-mission-control-5.14.1/work/telepathy-mission-control-5.14.1/tests/twisted'
make[4]: *** [check-am] Error 2
make[4]: Leaving directory
`/var/tmp/portage/net-im/telepathy-mission-control-5.14.1/work/telepathy-mission-control-5.14.1/tests/twisted'
make[3]: *** [check-recursive] Error 1
make[3]: Leaving directory
`/var/tmp/portage/net-im/telepathy-mission-control-5.14.1/work/telepathy-mission-control-5.14.1/tests/twisted'
make[2]: *** [check] Error 2
make[2]: Leaving directory
`/var/tmp/portage/net-im/telepathy-mission-control-5.14.1/work/telepathy-mission-control-5.14.1/tests/twisted'
make[1]: *** [check-recursive] Error 1

-- 
You are receiving this mail because:
You are the QA Contact for the bug.
You are the assignee for the bug.



More information about the telepathy-bugs mailing list