[cairo] [RE]compilation error PLZ HELP

tasos tas0s at yahoo.com
Tue Apr 11 00:54:00 PDT 2006

hello and thx for aswering!
another problem
gcc -g -O2 -o .libs/imagediff imagediff.o 
./.libs/libcairotest.a ../src/.libs/libcairo.so
-L/usr/X11R6/lib -lXrender -lXext -lX11
-L/usr/local/lib -lpng12
/usr/lib/libfreetype.so /usr/lib/libexpat.so
/usr/local/lib/libfreetype.so -lz -lpthread -lm
-Wl,--rpath -Wl,/usr//lib
./.libs/libcairotest.a(cairo-test.o)(.text+0x7e9): In
function `cairo_test_expecting':
undefined reference to `FcFini'
collect2: ld returned 1 exit status
make[2]: *** [imagediff] Error 1
make[2]: Leaving directory
make[1]: *** [all-recursive] Error 1
make[1]: Leaving directory
make: *** [all] Error 2

Do You Yahoo!?
Tired of spam?  Yahoo! Mail has the best spam protection around 

More information about the cairo mailing list