no makefile in 'dmake/tests'

John Smith lbalbalba at
Wed Aug 8 08:59:30 PDT 2012


Im running into a compilation issue on Linux with latest maters
sources. There is no 'Makefile' in the dmake/tests directory, only a
'' and a ''. This stops the build process for
me. I was under the impression that that Makefile should be generated
by ./configure ? Anway, here's what the output looks like :

# make all
make -r -f /usr/local/src/libreoffice/ all
make[1]: Entering directory `/usr/local/src/libreoffice'
make[2]: Entering directory `/usr/local/src/libreoffice/dmake'
Making distclean in tests
make[3]: Entering directory `/usr/local/src/libreoffice/dmake/tests'
make[3]: *** No rule to make target `distclean'.  Stop.
make[3]: Leaving directory `/usr/local/src/libreoffice/dmake/tests'
make[2]: *** [distclean-recursive] Error 1
make[2]: Leaving directory `/usr/local/src/libreoffice/dmake'
make[1]: *** [/usr/local/src/libreoffice/workdir/] Error 2
make[1]: Leaving directory `/usr/local/src/libreoffice'
make: *** [all] Error 2
# ls -l dmake/tests/Make*
-rw-r--r--. 1 root root  1133 Aug  4 12:26 dmake/tests/
-rw-r--r--. 1 root root 11645 Aug  4 12:26 dmake/tests/


John Smith.

More information about the LibreOffice mailing list