[poppler] building poppler on cygwin -basics-

Jordi jordotel at gmail.com
Sun Feb 25 10:41:39 PST 2007


I am trying to build poppler on a cygwin environment with all packages
if Trying to build from cygwin bash shell
   problems with running autogen.sh shell script
elif trying to build from sh /usr/X11R6/bin/startxwin.sh xtern window
 I get from output window
 undefined references to `operator new(unsigned int)' follow,,,,,
/home/x/poppler-0.5.4/fofi/FoFiType1.cc:47: undefined reference to `___gxx_p
/home/x/poppler-0.5.4/fofi/FoFiType1.cc:59: undefined reference to `operator
/home/x/poppler-0.5.4/poppler/.libs/libpoppler.a(FoFiType1.o): In function `
/home/x/poppler-0.5.4/fofi/FoFiType1.cc:39: undefined reference to `vtable f
/home/x/poppler-0.5.4/poppler/.libs/libpoppler.a(JArithmeticDecoder.o): In f
/home/x/poppler-0.5.4/poppler/JArithmeticDecoder.cc:33: undefined reference
/home/x/poppler-0.5.4/poppler/JArithmeticDecoder.cc:36: undefined reference
/home/x/poppler-0.5.4/poppler/JArithmeticDecoder.cc:36: undefined reference
collect2: ld returned 1 exit status
make[4]: *** [test-poppler-glib.exe] Error 1
make[4]: Leaving directory `/home/x/poppler-0.5.4/glib'
make[3]: *** [all-recursive] Error 1
make[3]: Leaving directory `/home/x/poppler-0.5.4/glib'
make[2]: *** [all] Error 2
make[2]: Leaving directory `/home/x/poppler-0.5.4/glib'
make[1]: *** [all-recursive] Error 1
make[1]: Leaving directory `/home/x/poppler-0.5.4'
make: *** [all] Error 2

Which options I have to pass to configure script to try to build correctly.
Or what I am doing wrong or what I have to know or understand or....

Sorry in advance If I didn't post in the right mailing list.
And thanks in advance for answers.

More information about the poppler mailing list